Console Output

Push event to branch master
Running with default Jenkinsfile ID: ScmPluginJenkinsfile
Running in Durability level: MAX_SURVIVABILITY
[Pipeline] Start of Pipeline
[Pipeline] node
Running on oss-ubuntu-mgcc6z in /tmp/workspace/ns_scm-ssl-context-plugin_master
[Pipeline] {
15:36:56 Connecting to https://api.github.com using cesmarvin/****** (CESMarvin at Github)
[Pipeline] stage
[Pipeline] { (Declarative: Checkout SCM)
[Pipeline] checkout
The recommended git tool is: NONE
using credential cesmarvin-github
Cloning the remote Git repository
Cloning with configured refspecs honoured and without tags
Avoid second fetch
Checking out Revision 6cfec7c260387d5e7f35e07e5adfd8c33e0ea8a6 (master)
Commit message: "release version 1.1.0"
Cloning repository https://github.com/scm-manager/scm-ssl-context-plugin.git
 > git init /tmp/workspace/ns_scm-ssl-context-plugin_master # timeout=10
Fetching upstream changes from https://github.com/scm-manager/scm-ssl-context-plugin.git
 > git --version # timeout=10
 > git --version # 'git version 2.25.1'
using GIT_ASKPASS to set credentials CESMarvin at Github
 > git fetch --no-tags --force --progress -- https://github.com/scm-manager/scm-ssl-context-plugin.git +refs/heads/master:refs/remotes/origin/master # timeout=10
 > git config remote.origin.url https://github.com/scm-manager/scm-ssl-context-plugin.git # timeout=10
 > git config --add remote.origin.fetch +refs/heads/master:refs/remotes/origin/master # timeout=10
 > git config core.sparsecheckout # timeout=10
 > git checkout -f 6cfec7c260387d5e7f35e07e5adfd8c33e0ea8a6 # timeout=10
 > git branch -a -v --no-abbrev # timeout=10
 > git checkout -b master 6cfec7c260387d5e7f35e07e5adfd8c33e0ea8a6 # timeout=10
 > git rev-list --no-walk f5785440a82f5fd7ec8e19632a1c95a518cf0c1d # timeout=10
[Pipeline] }
[Pipeline] // stage
[Pipeline] withEnv
[Pipeline] {
[Pipeline] isUnix
[Pipeline] sh
+ docker inspect -f . scmmanager/java-build:11.0.9_11.1
.
[Pipeline] withDockerContainer
oss-ubuntu-mgcc6z does not seem to be running inside a container
$ docker run -t -d -u 1001:1002 -w /tmp/workspace/ns_scm-ssl-context-plugin_master -v /tmp/workspace/ns_scm-ssl-context-plugin_master:/tmp/workspace/ns_scm-ssl-context-plugin_master:rw,z -v /tmp/workspace/ns_scm-ssl-context-plugin_master@tmp:/tmp/workspace/ns_scm-ssl-context-plugin_master@tmp:rw,z -e ******** -e ******** -e ******** -e ******** -e ******** -e ******** -e ******** -e ******** -e ******** -e ******** -e ******** -e ******** -e ******** -e ******** -e ******** -e ******** -e ******** -e ******** -e ******** -e ******** -e ******** -e ******** -e ******** -e ******** -e ******** -e ******** -e ******** -e ******** -e ******** -e ******** -e ******** -e ******** -e ******** -e ******** -e ******** scmmanager/java-build:11.0.9_11.1 cat
$ docker top 121ea5c685b1cdaecb102629b8837dc48cf0106ea841397e517856e3526e3c45 -eo pid,comm
[Pipeline] {
[Pipeline] withEnv
[Pipeline] {
[Pipeline] stage
[Pipeline] { (Prepare build)
[Pipeline] script
[Pipeline] {
[Pipeline] fileExists
[Pipeline] }
[Pipeline] // script
[Pipeline] }
[Pipeline] // stage
[Pipeline] stage
[Pipeline] { (Set Version)
Stage "Set Version" skipped due to when conditional
[Pipeline] }
[Pipeline] // stage
[Pipeline] stage
[Pipeline] { (Build)
[Pipeline] script
[Pipeline] {
[Pipeline] sh
+ ./gradlew build -xtest
Downloading https://services.gradle.org/distributions/gradle-6.7.1-bin.zip
.........10%..........20%..........30%..........40%..........50%.........60%..........70%..........80%..........90%..........100%

Welcome to Gradle 6.7.1!

Here are the highlights of this release:
 - File system watching is ready for production use
 - Declare the version of Java your build requires
 - Java 15 support

For more details see https://docs.gradle.org/6.7.1/release-notes.html

Starting a Gradle Daemon (subsequent builds will be faster)

FAILURE: Build failed with an exception.

* What went wrong:
A problem occurred configuring root project 'scm-ssl-context-plugin'.
> Could not resolve all artifacts for configuration ':classpath'.
   > Could not download gradle-node-plugin-2.2.4.jar (com.github.node-gradle:gradle-node-plugin:2.2.4)
      > Could not get resource 'https://plugins.gradle.org/m2/com/github/node-gradle/gradle-node-plugin/2.2.4/gradle-node-plugin-2.2.4.jar'.
         > Could not GET 'https://plugins-artifacts.gradle.org/com.github.node-gradle/gradle-node-plugin/2.2.4/e8e2f243251a77a95303e58a4539cf1fab1420026daa68e881bb34627b4147db/gradle-node-plugin-2.2.4.jar'. Received status code 502 from server: Bad Gateway

* Try:
Run with --stacktrace option to get the stack trace. Run with --info or --debug option to get more log output. Run with --scan to get full insights.

* Get more help at https://help.gradle.org

BUILD FAILED in 36s
[Pipeline] }
[Pipeline] // script
[Pipeline] }
[Pipeline] // stage
[Pipeline] stage
[Pipeline] { (Check)
Stage "Check" skipped due to earlier failure(s)
[Pipeline] }
[Pipeline] // stage
[Pipeline] stage
[Pipeline] { (SonarQube)
Stage "SonarQube" skipped due to earlier failure(s)
[Pipeline] }
[Pipeline] // stage
[Pipeline] stage
[Pipeline] { (Deployment)
Stage "Deployment" skipped due to earlier failure(s)
[Pipeline] }
[Pipeline] // stage
[Pipeline] stage
[Pipeline] { (Push Tag)
Stage "Push Tag" skipped due to earlier failure(s)
[Pipeline] }
[Pipeline] // stage
[Pipeline] stage
[Pipeline] { (Plugin Center)
Stage "Plugin Center" skipped due to earlier failure(s)
[Pipeline] }
[Pipeline] // stage
[Pipeline] stage
[Pipeline] { (Set Next Version)
Stage "Set Next Version" skipped due to earlier failure(s)
[Pipeline] }
[Pipeline] // stage
[Pipeline] stage
[Pipeline] { (Delete Release Branch)
Stage "Delete Release Branch" skipped due to earlier failure(s)
[Pipeline] }
[Pipeline] // stage
[Pipeline] stage
[Pipeline] { (Declarative: Post Actions)
[Pipeline] mail
[Pipeline] }
[Pipeline] // stage
[Pipeline] }
[Pipeline] // withEnv
[Pipeline] }
$ docker stop --time=1 121ea5c685b1cdaecb102629b8837dc48cf0106ea841397e517856e3526e3c45
$ docker rm -f 121ea5c685b1cdaecb102629b8837dc48cf0106ea841397e517856e3526e3c45
[Pipeline] // withDockerContainer
[Pipeline] }
[Pipeline] // withEnv
[Pipeline] }
[Pipeline] // node
[Pipeline] End of Pipeline

GitHub has been notified of this commit’s build result

ERROR: script returned exit code 1
Finished: FAILURE