Console Output

Pull request #28 updated
Running with default Jenkinsfile ID: ScmPluginJenkinsfile
Running in Durability level: MAX_SURVIVABILITY
[Pipeline] Start of Pipeline
[Pipeline] node
Running on oss-ubuntu-qebr2e in /tmp/workspace/ger-plugins_scm-cas-plugin_PR-28
[Pipeline] {
14:26:06 Connecting to https://api.github.com using CESMarvin at Github
[Pipeline] stage
[Pipeline] { (Declarative: Checkout SCM)
[Pipeline] checkout
The recommended git tool is: NONE
using credential cesmarvin-github
Cloning the remote Git repository
Cloning with configured refspecs honoured and without tags
Cloning repository https://github.com/scm-manager/scm-cas-plugin.git
 > git init /tmp/workspace/ger-plugins_scm-cas-plugin_PR-28 # timeout=10
Fetching upstream changes from https://github.com/scm-manager/scm-cas-plugin.git
 > git --version # timeout=10
 > git --version # 'git version 2.25.1'
using GIT_ASKPASS to set credentials CESMarvin at Github
 > git fetch --no-tags --force --progress -- https://github.com/scm-manager/scm-cas-plugin.git +refs/pull/28/head:refs/remotes/origin/PR-28 +refs/heads/develop:refs/remotes/origin/develop # timeout=10
Fetching without tags
Merging remotes/origin/develop commit 30eaf31ed90b49e1c082fc3b24f648d5a07b3f1c into PR head commit 78f234c407f3481a11c421bcf1308a5b139b29cc
Merge succeeded, producing 78f234c407f3481a11c421bcf1308a5b139b29cc
Checking out Revision 78f234c407f3481a11c421bcf1308a5b139b29cc (PR-28)
Commit message: "Store subject with cas token for the logout event"
 > git config remote.origin.url https://github.com/scm-manager/scm-cas-plugin.git # timeout=10
 > git config --add remote.origin.fetch +refs/pull/28/head:refs/remotes/origin/PR-28 # timeout=10
 > git config --add remote.origin.fetch +refs/heads/develop:refs/remotes/origin/develop # timeout=10
 > git config remote.origin.url https://github.com/scm-manager/scm-cas-plugin.git # timeout=10
Fetching upstream changes from https://github.com/scm-manager/scm-cas-plugin.git
using GIT_ASKPASS to set credentials CESMarvin at Github
 > git fetch --no-tags --force --progress -- https://github.com/scm-manager/scm-cas-plugin.git +refs/pull/28/head:refs/remotes/origin/PR-28 +refs/heads/develop:refs/remotes/origin/develop # timeout=10
 > git config core.sparsecheckout # timeout=10
 > git checkout -f 78f234c407f3481a11c421bcf1308a5b139b29cc # timeout=10
 > git remote # timeout=10
 > git config --get remote.origin.url # timeout=10
using GIT_ASKPASS to set credentials CESMarvin at Github
 > git merge 30eaf31ed90b49e1c082fc3b24f648d5a07b3f1c # timeout=10
 > git rev-parse HEAD^{commit} # timeout=10
 > git config core.sparsecheckout # timeout=10
 > git checkout -f 78f234c407f3481a11c421bcf1308a5b139b29cc # timeout=10
 > git branch -a -v --no-abbrev # timeout=10
 > git checkout -b PR-28 78f234c407f3481a11c421bcf1308a5b139b29cc # timeout=10
 > git rev-list --no-walk d57919210ce6dfb2e2741775236e9454b90f8355 # timeout=10
[Pipeline] }
[Pipeline] // stage
[Pipeline] withEnv
[Pipeline] {
[Pipeline] isUnix
[Pipeline] sh
+ docker inspect -f . scmmanager/java-build:11.0.9_11.1
.
[Pipeline] withDockerContainer
oss-ubuntu-qebr2e does not seem to be running inside a container
$ docker run -t -d -u 1001:1002 -w /tmp/workspace/ger-plugins_scm-cas-plugin_PR-28 -v /tmp/workspace/ger-plugins_scm-cas-plugin_PR-28:/tmp/workspace/ger-plugins_scm-cas-plugin_PR-28:rw,z -v /tmp/workspace/ger-plugins_scm-cas-plugin_PR-28@tmp:/tmp/workspace/ger-plugins_scm-cas-plugin_PR-28@tmp:rw,z -e ******** -e ******** -e ******** -e ******** -e ******** -e ******** -e ******** -e ******** -e ******** -e ******** -e ******** -e ******** -e ******** -e ******** -e ******** -e ******** -e ******** -e ******** -e ******** -e ******** -e ******** -e ******** -e ******** -e ******** -e ******** -e ******** -e ******** -e ******** -e ******** -e ******** -e ******** -e ******** -e ******** -e ******** -e ******** -e ******** -e ******** -e ******** -e ******** -e ******** -e ******** -e ******** -e ******** scmmanager/java-build:11.0.9_11.1 cat
$ docker top 2de34fe25a2884cb9a9ac3c3a17b6232b183497d06a047ebb42b218cfffa127a -eo pid,comm
[Pipeline] {
[Pipeline] withEnv
[Pipeline] {
[Pipeline] stage
[Pipeline] { (Prepare build)
[Pipeline] script
[Pipeline] {
[Pipeline] fileExists
[Pipeline] }
[Pipeline] // script
[Pipeline] }
[Pipeline] // stage
[Pipeline] stage
[Pipeline] { (Set Version)
Stage "Set Version" skipped due to when conditional
[Pipeline] }
[Pipeline] // stage
[Pipeline] stage
[Pipeline] { (Build)
[Pipeline] script
[Pipeline] {
[Pipeline] sh
+ ./gradlew build -xtest
Downloading https://services.gradle.org/distributions/gradle-6.7.1-bin.zip
.........10%..........20%..........30%..........40%..........50%.........60%..........70%..........80%..........90%..........100%

Welcome to Gradle 6.7.1!

Here are the highlights of this release:
 - File system watching is ready for production use
 - Declare the version of Java your build requires
 - Java 15 support

For more details see https://docs.gradle.org/6.7.1/release-notes.html

Starting a Gradle Daemon (subsequent builds will be faster)

> Task :compileJava FAILED
/tmp/workspace/ger-plugins_scm-cas-plugin_PR-28/src/main/java/com/cloudogu/scm/cas/browser/LogoutHandler.java:29: error: cannot find symbol
import sonia.scm.security.LogoutEvent;
                         ^
  symbol:   class LogoutEvent
  location: package sonia.scm.security
1 error

FAILURE: Build failed with an exception.

* What went wrong:
Execution failed for task ':compileJava'.
> Compilation failed; see the compiler error output for details.

* Try:
Run with --stacktrace option to get the stack trace. Run with --info or --debug option to get more log output. Run with --scan to get full insights.

* Get more help at https://help.gradle.org

BUILD FAILED in 40s
1 actionable task: 1 executed
[Pipeline] }
[Pipeline] // script
[Pipeline] }
[Pipeline] // stage
[Pipeline] stage
[Pipeline] { (Check)
Stage "Check" skipped due to earlier failure(s)
[Pipeline] }
[Pipeline] // stage
[Pipeline] stage
[Pipeline] { (SonarQube)
Stage "SonarQube" skipped due to earlier failure(s)
[Pipeline] }
[Pipeline] // stage
[Pipeline] stage
[Pipeline] { (Deployment)
Stage "Deployment" skipped due to earlier failure(s)
[Pipeline] }
[Pipeline] // stage
[Pipeline] stage
[Pipeline] { (Push Tag)
Stage "Push Tag" skipped due to earlier failure(s)
[Pipeline] }
[Pipeline] // stage
[Pipeline] stage
[Pipeline] { (Plugin Center)
Stage "Plugin Center" skipped due to earlier failure(s)
[Pipeline] }
[Pipeline] // stage
[Pipeline] stage
[Pipeline] { (Set Next Version)
Stage "Set Next Version" skipped due to earlier failure(s)
[Pipeline] }
[Pipeline] // stage
[Pipeline] stage
[Pipeline] { (Delete Release Branch)
Stage "Delete Release Branch" skipped due to earlier failure(s)
[Pipeline] }
[Pipeline] // stage
[Pipeline] stage
[Pipeline] { (Declarative: Post Actions)
[Pipeline] mail
[Pipeline] }
[Pipeline] // stage
[Pipeline] }
[Pipeline] // withEnv
[Pipeline] }
$ docker stop --time=1 2de34fe25a2884cb9a9ac3c3a17b6232b183497d06a047ebb42b218cfffa127a
$ docker rm -f 2de34fe25a2884cb9a9ac3c3a17b6232b183497d06a047ebb42b218cfffa127a
[Pipeline] // withDockerContainer
[Pipeline] }
[Pipeline] // withEnv
[Pipeline] }
[Pipeline] // node
[Pipeline] End of Pipeline
ERROR: script returned exit code 1

GitHub has been notified of this commit’s build result

Finished: FAILURE