Console Output

Pull request #28 updated
Running with default Jenkinsfile ID: ScmPluginJenkinsfile
Running in Durability level: MAX_SURVIVABILITY
[Pipeline] Start of Pipeline
[Pipeline] node
Running on oss-ubuntu-senm2y in /tmp/workspace/ger-plugins_scm-cas-plugin_PR-28
[Pipeline] {
17:31:03 Connecting to https://api.github.com using CESMarvin at Github
[Pipeline] stage
[Pipeline] { (Declarative: Checkout SCM)
[Pipeline] checkout
The recommended git tool is: NONE
using credential cesmarvin-github
Fetching changes from the remote Git repository
Fetching without tags
Merging remotes/origin/develop commit 30eaf31ed90b49e1c082fc3b24f648d5a07b3f1c into PR head commit d57919210ce6dfb2e2741775236e9454b90f8355
Merge succeeded, producing d57919210ce6dfb2e2741775236e9454b90f8355
Checking out Revision d57919210ce6dfb2e2741775236e9454b90f8355 (PR-28)
Commit message: "Add logging"
 > git rev-parse --resolve-git-dir /tmp/workspace/ger-plugins_scm-cas-plugin_PR-28/.git # timeout=10
 > git config remote.origin.url https://github.com/scm-manager/scm-cas-plugin.git # timeout=10
Fetching upstream changes from https://github.com/scm-manager/scm-cas-plugin.git
 > git --version # timeout=10
 > git --version # 'git version 2.25.1'
using GIT_ASKPASS to set credentials CESMarvin at Github
 > git fetch --no-tags --force --progress -- https://github.com/scm-manager/scm-cas-plugin.git +refs/pull/28/head:refs/remotes/origin/PR-28 +refs/heads/develop:refs/remotes/origin/develop # timeout=10
 > git config core.sparsecheckout # timeout=10
 > git checkout -f d57919210ce6dfb2e2741775236e9454b90f8355 # timeout=10
 > git remote # timeout=10
 > git config --get remote.origin.url # timeout=10
using GIT_ASKPASS to set credentials CESMarvin at Github
 > git merge 30eaf31ed90b49e1c082fc3b24f648d5a07b3f1c # timeout=10
 > git rev-parse HEAD^{commit} # timeout=10
 > git config core.sparsecheckout # timeout=10
 > git checkout -f d57919210ce6dfb2e2741775236e9454b90f8355 # timeout=10
 > git branch -a -v --no-abbrev # timeout=10
 > git branch -D PR-28 # timeout=10
 > git checkout -b PR-28 d57919210ce6dfb2e2741775236e9454b90f8355 # timeout=10
 > git rev-list --no-walk 4c6e5d1b61649f4e5cbd55012c5cd02381a2fb20 # timeout=10
[Pipeline] }
[Pipeline] // stage
[Pipeline] withEnv
[Pipeline] {
[Pipeline] isUnix
[Pipeline] sh
+ docker inspect -f . scmmanager/java-build:11.0.9_11.1
.
[Pipeline] withDockerContainer
oss-ubuntu-senm2y does not seem to be running inside a container
$ docker run -t -d -u 1001:1002 -w /tmp/workspace/ger-plugins_scm-cas-plugin_PR-28 -v /tmp/workspace/ger-plugins_scm-cas-plugin_PR-28:/tmp/workspace/ger-plugins_scm-cas-plugin_PR-28:rw,z -v /tmp/workspace/ger-plugins_scm-cas-plugin_PR-28@tmp:/tmp/workspace/ger-plugins_scm-cas-plugin_PR-28@tmp:rw,z -e ******** -e ******** -e ******** -e ******** -e ******** -e ******** -e ******** -e ******** -e ******** -e ******** -e ******** -e ******** -e ******** -e ******** -e ******** -e ******** -e ******** -e ******** -e ******** -e ******** -e ******** -e ******** -e ******** -e ******** -e ******** -e ******** -e ******** -e ******** -e ******** -e ******** -e ******** -e ******** -e ******** -e ******** -e ******** -e ******** -e ******** -e ******** -e ******** -e ******** -e ******** -e ******** -e ******** scmmanager/java-build:11.0.9_11.1 cat
$ docker top 755fc0739f33d7e2bf2462d3d4ff53af5e46de6c9a10317b2420c36627acd920 -eo pid,comm
[Pipeline] {
[Pipeline] withEnv
[Pipeline] {
[Pipeline] stage
[Pipeline] { (Prepare build)
[Pipeline] script
[Pipeline] {
[Pipeline] fileExists
[Pipeline] }
[Pipeline] // script
[Pipeline] }
[Pipeline] // stage
[Pipeline] stage
[Pipeline] { (Set Version)
Stage "Set Version" skipped due to when conditional
[Pipeline] }
[Pipeline] // stage
[Pipeline] stage
[Pipeline] { (Build)
[Pipeline] script
[Pipeline] {
[Pipeline] sh
+ ./gradlew build -xtest
Starting a Gradle Daemon, 1 incompatible and 1 stopped Daemons could not be reused, use --status for details

> Task :compileJava FAILED
/tmp/workspace/ger-plugins_scm-cas-plugin_PR-28/src/main/java/com/cloudogu/scm/cas/browser/LogoutHandler.java:29: error: cannot find symbol
import sonia.scm.security.LogoutEvent;
                         ^
  symbol:   class LogoutEvent
  location: package sonia.scm.security
1 error

FAILURE: Build failed with an exception.

* What went wrong:
Execution failed for task ':compileJava'.
> Compilation failed; see the compiler error output for details.

* Try:
Run with --stacktrace option to get the stack trace. Run with --info or --debug option to get more log output. Run with --scan to get full insights.

* Get more help at https://help.gradle.org

BUILD FAILED in 13s
1 actionable task: 1 executed
[Pipeline] }
[Pipeline] // script
[Pipeline] }
[Pipeline] // stage
[Pipeline] stage
[Pipeline] { (Check)
Stage "Check" skipped due to earlier failure(s)
[Pipeline] }
[Pipeline] // stage
[Pipeline] stage
[Pipeline] { (SonarQube)
Stage "SonarQube" skipped due to earlier failure(s)
[Pipeline] }
[Pipeline] // stage
[Pipeline] stage
[Pipeline] { (Deployment)
Stage "Deployment" skipped due to earlier failure(s)
[Pipeline] }
[Pipeline] // stage
[Pipeline] stage
[Pipeline] { (Push Tag)
Stage "Push Tag" skipped due to earlier failure(s)
[Pipeline] }
[Pipeline] // stage
[Pipeline] stage
[Pipeline] { (Plugin Center)
Stage "Plugin Center" skipped due to earlier failure(s)
[Pipeline] }
[Pipeline] // stage
[Pipeline] stage
[Pipeline] { (Set Next Version)
Stage "Set Next Version" skipped due to earlier failure(s)
[Pipeline] }
[Pipeline] // stage
[Pipeline] stage
[Pipeline] { (Delete Release Branch)
Stage "Delete Release Branch" skipped due to earlier failure(s)
[Pipeline] }
[Pipeline] // stage
[Pipeline] stage
[Pipeline] { (Declarative: Post Actions)
[Pipeline] mail
[Pipeline] }
[Pipeline] // stage
[Pipeline] }
[Pipeline] // withEnv
[Pipeline] }
$ docker stop --time=1 755fc0739f33d7e2bf2462d3d4ff53af5e46de6c9a10317b2420c36627acd920
$ docker rm -f 755fc0739f33d7e2bf2462d3d4ff53af5e46de6c9a10317b2420c36627acd920
[Pipeline] // withDockerContainer
[Pipeline] }
[Pipeline] // withEnv
[Pipeline] }
[Pipeline] // node
[Pipeline] End of Pipeline
ERROR: script returned exit code 1

GitHub has been notified of this commit’s build result

Finished: FAILURE